Error Installing Unix daemon from Tomcat 5.5
0 posts in topic
Flat View  Flat View
TOPIC ACTIONS:
 

Posted By:   Elisei_Rotaru
Posted On:   Wednesday, October 26, 2005 06:42 PM

Hey, I just downloaded Tomcat 5.5 Core binaries from the Apache Homepage, and tried to install the Unix Daemon as written in the Documentation. autoconf worked fine. ./configure worked fine. make failed with many errors. How to fix this? The errors are below. Many thanks, elisei@pluto:/usr/java/apache-tomcat-5.5.12/bin/jsvc-src$ autoconf elisei@pluto:/usr/java/apache-tomcat-5.5.12/bin/jsvc-src$ chmod 777 configure elisei@pluto:/usr/java/apache-tomcat-5.5.12/bin/jsvc-src$ echo $JAVA_HOME /usr/lib/fjsdk elisei@pluto:/usr/java/apache-tomcat-5.5.12/bin/jsvc-src$ ./configure *** Current host ***   More>>

Hey,


I just downloaded Tomcat 5.5 Core binaries from the Apache Homepage, and tried to install the Unix Daemon as written in the Documentation.




autoconf worked fine.

./configure worked fine.

make failed with many errors.



How to fix this?


The errors are below.


Many thanks,



			
elisei@pluto:/usr/java/apache-tomcat-5.5.12/bin/jsvc-src$ autoconf
elisei@pluto:/usr/java/apache-tomcat-5.5.12/bin/jsvc-src$ chmod 777 configure
elisei@pluto:/usr/java/apache-tomcat-5.5.12/bin/jsvc-src$ echo $JAVA_HOME
/usr/lib/fjsdk
elisei@pluto:/usr/java/apache-tomcat-5.5.12/bin/jsvc-src$ ./configure
*** Current host ***
checking build system type... i686-pc-linux-gnu
checking host system type... i686-pc-linux-gnu
checking cached host system type... ok
*** C-Language compilation tools ***
checking for gcc... gcc
checking for C compiler default output file name... a.out
checking whether the C compiler works... yes
checking whether we are cross compiling... no
checking for suffix of executables...
checking for suffix of object files... o
checking whether we are using the GNU C compiler... yes
checking whether gcc accepts -g... yes
checking for gcc option to accept ANSI C... none needed
checking for ranlib... ranlib
*** Host support ***
checking C flags dependant on host system type... ok
*** Java compilation tools ***
checking for javac... /usr/lib/fjsdk/bin/javac
checking wether the Java compiler (/usr/lib/fjsdk/bin/javac) works... yes
checking for jar... /usr/lib/fjsdk/bin/jar
gcc flags added
*** Writing output files ***
configure: creating ./config.status
config.status: creating Makefile
config.status: creating Makedefs
config.status: creating native/Makefile
*** All done ***
Now you can issue "make"
elisei@pluto:/usr/java/apache-tomcat-5.5.12/bin/jsvc-src$ make
make -C native all
make[1]: Entering directory `/usr/java/apache-tomcat-5.5.12/bin/jsvc-src/native'
gcc -g -O2 -DOS_LINUX -DDSO_DLFCN -DCPU="i386" -I/usr/lib/fjsdk/include -I/usr/lib/fjsdk/include/linux -Wall -Wstrict-prototypes -c jsvc-unix.c -o jsvc-unix.o
gcc -g -O2 -DOS_LINUX -DDSO_DLFCN -DCPU="i386" -I/usr/lib/fjsdk/include -I/usr/lib/fjsdk/include/linux -Wall -Wstrict-prototypes -c arguments.c -o arguments.o
arguments.c: In function 'arguments':
arguments.c:251: warning: unused variable 'temp'
gcc -g -O2 -DOS_LINUX -DDSO_DLFCN -DCPU="i386" -I/usr/lib/fjsdk/include -I/usr/lib/fjsdk/include/linux -Wall -Wstrict-prototypes -c debug.c -o debug.o
gcc -g -O2 -DOS_LINUX -DDSO_DLFCN -DCPU="i386" -I/usr/lib/fjsdk/include -I/usr/lib/fjsdk/include/linux -Wall -Wstrict-prototypes -c dso-dlfcn.c -o dso-dlfcn.o
dso-dlfcn.c:51: warning: function declaration isn't a prototype
gcc -g -O2 -DOS_LINUX -DDSO_DLFCN -DCPU="i386" -I/usr/lib/fjsdk/include -I/usr/lib/fjsdk/include/linux -Wall -Wstrict-prototypes -c dso-dyld.c -o dso-dyld.o
gcc -g -O2 -DOS_LINUX -DDSO_DLFCN -DCPU="i386" -I/usr/lib/fjsdk/include -I/usr/lib/fjsdk/include/linux -Wall -Wstrict-prototypes -c help.c -o help.o
gcc -g -O2 -DOS_LINUX -DDSO_DLFCN -DCPU="i386" -I/usr/lib/fjsdk/include -I/usr/lib/fjsdk/include/linux -Wall -Wstrict-prototypes -c home.c -o home.o
gcc -g -O2 -DOS_LINUX -DDSO_DLFCN -DCPU="i386" -I/usr/lib/fjsdk/include -I/usr/lib/fjsdk/include/linux -Wall -Wstrict-prototypes -c java.c -o java.o
java.c:22:17: error: jni.h: No such file or directory
java.c:35: error: syntax error before '*' token
java.c:35: warning: type defaults to 'int' in declaration of 'jvm'
java.c:35: warning: data definition has no type or storage class
java.c:36: error: syntax error before '*' token
java.c:36: warning: type defaults to 'int' in declaration of 'env'
java.c:36: warning: data definition has no type or storage class
java.c:37: error: syntax error before 'cls'
java.c:37: warning: type defaults to 'int' in declaration of 'cls'
java.c:37: warning: initialization makes integer from pointer without a cast
java.c:37: warning: data definition has no type or storage class
java.c:42: error: syntax error before '*' token
java.c:42: warning: function declaration isn't a prototype
java.c: In function 'shutdown':
java.c:43: error: 'reload' undeclared (first use in this function)
java.c:43: error: (Each undeclared identifier is reported only once
java.c:43: error: for each function it appears in.)
java.c: At top level:
java.c:49: warning: function declaration isn't a prototype
java.c: In function 'java_init':
java.c:91: warning: implicit declaration of function 'jint'
java.c:91: error: 'symb' undeclared (first use in this function)
java.c:91: error: 'JavaVM' undeclared (first use in this function)
java.c:91: error: syntax error before ',' token
java.c:92: error: 'JNINativeMethod' undeclared (first use in this function)
java.c:93: error: 'JavaVMOption' undeclared (first use in this function)
java.c:93: error: 'opt' undeclared (first use in this function)
java.c:95: error: 'JavaVMInitArgs' undeclared (first use in this function)
java.c:95: error: syntax error before 'arg'
java.c:97: error: syntax error before 'ret'
java.c:122: warning: implicit declaration of function 'dso_error'
java.c:180: error: 'arg' undeclared (first use in this function)
java.c:180: error: 'JNI_VERSION_1_2' undeclared (first use in this function)
java.c:191: error: syntax error before ')' token
java.c:223: error: 'ret' undeclared (first use in this function)
java.c:232: error: invalid type argument of '->'
java.c:234: warning: comparison between pointer and integer
java.c:241: error: 'nativemethod' undeclared (first use in this function)
java.c:245: error: invalid type argument of '->'
java.c: In function 'JVM_destroy':
java.c:256: error: 'jclass' undeclared (first use in this function)
java.c:256: error: syntax error before 'system'
java.c:257: error: 'jmethodID' undeclared (first use in this function)
java.c:263: error: invalid type argument of '->'
java.c:272: error: 'method' undeclared (first use in this function)
java.c:272: error: invalid type argument of '->'
java.c:279: error: invalid type argument of '->'
java.c:279: error: 'jint' undeclared (first use in this function)
java.c:279: error: syntax error before 'exit'
java.c:283: error: invalid type argument of '->'
java.c: In function 'java_load':
java.c:290: error: 'jclass' undeclared (first use in this function)
java.c:290: error: syntax error before 'stringClass'
java.c:291: error: 'jstring' undeclared (first use in this function)
java.c:293: error: 'jobjectArray' undeclared (first use in this function)
java.c:294: error: 'jmethodID' undeclared (first use in this function)
java.c:295: error: 'jboolean' undeclared (first use in this function)
java.c:302: error: 'className' undeclared (first use in this function)
java.c:302: error: invalid type argument of '->'
java.c:310: error: 'stringClass' undeclared (first use in this function)
java.c:310: error: invalid type argument of '->'
java.c:317: error: 'stringArray' undeclared (first use in this function)
java.c:317: error: invalid type argument of '->'
java.c:325: error: 'currentArgument' undeclared (first use in this function)
java.c:325: error: invalid type argument of '->'
java.c:331: error: invalid type argument of '->'
java.c:336: error: 'method' undeclared (first use in this function)
java.c:336: error: invalid type argument of '->'
java.c:342: error: 'ret' undeclared (first use in this function)
java.c:342: error: invalid type argument of '->'
java.c: In function 'java_start':
java.c:354: error: 'jmethodID' undeclared (first use in this function)
java.c:354: error: syntax error before 'method'
java.c:355: error: 'jboolean' undeclared (first use in this function)
java.c:361: error: 'method' undeclared (first use in this function)
java.c:361: error: invalid type argument of '->'
java.c:367: error: 'ret' undeclared (first use in this function)
java.c:367: error: invalid type argument of '->'
java.c: In function 'java_sleep':
java.c:381: error: 'jclass' undeclared (first use in this function)
java.c:381: error: syntax error before 'clsThread'
java.c:382: error: 'jmethodID' undeclared (first use in this function)
java.c:391: error: 'clsThread' undeclared (first use in this function)
java.c:391: error: invalid type argument of '->'
java.c:396: error: 'method' undeclared (first use in this function)
java.c:396: error: invalid type argument of '->'
java.c:402: error: invalid type argument of '->'
java.c:402: error: 'jlong' undeclared (first use in this function)
java.c:402: error: syntax error before 'wait'
java.c: In function 'java_stop':
java.c:407: error: 'jmethodID' undeclared (first use in this function)
java.c:407: error: syntax error before 'method'
java.c:408: error: 'jboolean' undeclared (first use in this function)
java.c:414: error: 'method' undeclared (first use in this function)
java.c:414: error: invalid type argument of '->'
java.c:420: error: 'ret' undeclared (first use in this function)
java.c:420: error: invalid type argument of '->'
java.c: In function 'java_version':
java.c:432: error: 'jmethodID' undeclared (first use in this function)
java.c:432: error: syntax error before 'method'
java.c:438: error: 'method' undeclared (first use in this function)
java.c:438: error: invalid type argument of '->'
java.c:444: error: invalid type argument of '->'
java.c: In function 'java_check':
java.c:450: error: 'jstring' undeclared (first use in this function)
java.c:450: error: syntax error before 'className'
java.c:451: error: 'jmethodID' undeclared (first use in this function)
java.c:452: error: 'jboolean' undeclared (first use in this function)
java.c:459: error: 'className' undeclared (first use in this function)
java.c:459: error: invalid type argument of '->'
java.c:468: error: 'method' undeclared (first use in this function)
java.c:468: error: invalid type argument of '->'
java.c:474: error: 'ret' undeclared (first use in this function)
java.c:474: error: invalid type argument of '->'
java.c: In function 'java_destroy':
java.c:486: error: 'jmethodID' undeclared (first use in this function)
java.c:486: error: syntax error before 'method'
java.c:487: error: 'jboolean' undeclared (first use in this function)
java.c:493: error: 'method' undeclared (first use in this function)
java.c:493: error: invalid type argument of '->'
java.c:499: error: 'ret' undeclared (first use in this function)
java.c:499: error: invalid type argument of '->'
make[1]: *** [java.o] Error 1
make[1]: Leaving directory `/usr/java/apache-tomcat-5.5.12/bin/jsvc-src/native'
make: *** [native/all] Error 2
   <<Less
About | Sitemap | Contact