problem in gmake while installing PostgreSQL
0 posts in topic
Flat View  Flat View
TOPIC ACTIONS:
 

Posted By:   shikha_aggarwal
Posted On:   Thursday, August 26, 2004 12:25 AM

hi, I am trying to install postgresql but following is the error coming when i run gmake command.can anybody help me?? error: gmake[4]: Leaving directory `/home/sal/postgresql-7.2.2/src/backend/utils/mmgr' gmake -C sort SUBSYS.o gmake[4]: Entering directory `/home/sal/postgresql-7.2.2/src/backend/utils/sort' gcc -O2 -Wall -Wmissing-prototypes -Wmissing-declarations -I../../../../src/include -c -o logtape.o logtape.c gcc -O2 -Wall -Wmissing-prototypes -Wmissing-declarations -I../../../../src/include -c -o tuplesort.o tuplesort.c gcc -O2 -Wall -Wmissing-prototypes -Wmissing-declarations -I../../../../src/include -c -o tuplestore.o tuplestore.c /usr/bin/ld -r -o SUBSYS.o log   More>>

hi, I am trying to install postgresql but following is the error coming when i run gmake command.can anybody help me??



error:


gmake[4]: Leaving directory `/home/sal/postgresql-7.2.2/src/backend/utils/mmgr'
gmake -C sort SUBSYS.o
gmake[4]: Entering directory `/home/sal/postgresql-7.2.2/src/backend/utils/sort'
gcc -O2 -Wall -Wmissing-prototypes -Wmissing-declarations -I../../../../src/include -c -o logtape.o logtape.c
gcc -O2 -Wall -Wmissing-prototypes -Wmissing-declarations -I../../../../src/include -c -o tuplesort.o tuplesort.c
gcc -O2 -Wall -Wmissing-prototypes -Wmissing-declarations -I../../../../src/include -c -o tuplestore.o tuplestore.c
/usr/bin/ld -r -o SUBSYS.o logtape.o tuplesort.o tuplestore.o
gmake[4]: Leaving directory `/home/sal/postgresql-7.2.2/src/backend/utils/sort'
gmake -C time SUBSYS.o
gmake[4]: Entering directory `/home/sal/postgresql-7.2.2/src/backend/utils/time'
gcc -O2 -Wall -Wmissing-prototypes -Wmissing-declarations -I../../../../src/include -c -o tqual.o tqual.c
/usr/bin/ld -r -o SUBSYS.o tqual.o
gmake[4]: Leaving directory `/home/sal/postgresql-7.2.2/src/backend/utils/time'
/usr/bin/ld -r -o SUBSYS.o fmgrtab.o adt/SUBSYS.o cache/SUBSYS.o error/SUBSYS.o fmgr/SUBSYS.o hash/SUBSYS.o init/SUBSYS.o misc/SUBSYS.o mmgr/SUBSYS.o sort/SUBSYS.o time/SUBSYS.o
gmake[3]: Leaving directory `/home/sal/postgresql-7.2.2/src/backend/utils'
gcc -O2 -Wall -Wmissing-prototypes -Wmissing-declarations -Wl,-rpath,/home/sal/PostgreSQL/lib -export-dynamic access/SUBSYS.o bootstrap/SUBSYS.o catalog/SUBSYS.o parser/SUBSYS.o commands/SUBSYS.o executor/SUBSYS.o lib/SUBSYS.o libpq/SUBSYS.o main/SUBSYS.o nodes/SUBSYS.o optimizer/SUBSYS.o port/SUBSYS.o postmaster/SUBSYS.o regex/SUBSYS.o rewrite/SUBSYS.o storage/SUBSYS.o tcop/SUBSYS.o utils/SUBSYS.o -lcrypt -lresolv -lnsl -ldl -lm -lbsd -o postgres
commands/SUBSYS.o(.text+0x46ef): In function `DoCopy':
: undefined reference to `errno'
commands/SUBSYS.o(.text+0x46f5): In function `DoCopy':
: undefined reference to `errno'
commands/SUBSYS.o(.text+0x4753): In function `DoCopy':
: undefined reference to `errno'
commands/SUBSYS.o(.text+0x475a): In function `DoCopy':
: undefined reference to `errno'
collect2: ld returned 1 exit status
gmake[2]: *** [postgres] Error 1
gmake[2]: Leaving directory `/home/sal/postgresql-7.2.2/src/backend'
gmake[1]: *** [all] Error 2
gmake[1]: Leaving directory `/home/sal/postgresql-7.2.2/src'
gmake: *** [all] Error 2





thanks
Shikha

   <<Less
About | Sitemap | Contact